Jump to content
OMRON Forums

CK3E help


fatihbeyy
 Share

Recommended Posts

PowerPmac ide version 2.2.1.25

Firmware version 2.3.1.0

Compile Error

What can be the problem

 

------ Build started: Project: PowerPmac5(192.168.1.125:arm,LS1021A-usermode), Configuration: Debug Any CPU ------

Please wait while mapping Power PMAC variables.

End of syncing the database.

PMAC variables are mapped successfully.

Build Process For capp1.out has started.

C:\Users\NacioOo\AppData\Local\Temp\h0fxxs2c.fnq\Temp\PowerPmac5.ppproj(0,0): Error : /usr/local/lib/gcc/arm-omron-linux-gnueabihf/4.6.4/../../../../arm-omron-linux-gnueabihf/bin/ld: cannot find -lpthread_rt

C:\Users\NacioOo\AppData\Local\Temp\h0fxxs2c.fnq\Temp\PowerPmac5.ppproj(0,0): Error : /usr/local/lib/gcc/arm-omron-linux-gnueabihf/4.6.4/../../../../arm-omron-linux-gnueabihf/bin/ld: cannot find -lxenomai

C:\Users\NacioOo\AppData\Local\Temp\h0fxxs2c.fnq\Temp\PowerPmac5.ppproj(0,0): Error : collect2: ld returned 1 exit status

Build Process For capp1.out has ended.

 

Done building project "PowerPmac5.ppproj" -- FAILED.

 

Build FAILED.

Project Building and Mapping total time = 1.343 sec

========== Build: 0 succeeded or up-to-date, 1 failed, 0 skipped ==========

Link to comment
Share on other sites

  • Replies 6
  • Created
  • Last Reply

Top Posters In This Topic

  • 1 month later...

I think this is a library issue.

 

At this path, "C:\DeltaTau\Power PMAC IDE\Compilers\usr\local\dtlibs", delete everything except for the "Default Libraries" folder. Then "unload/reload & clean" the project and then rebuild the project.

 

Hi Steve,

 

I have tested on your suggestion and keep getting the same issue.

This issue happen when I Uninstall IDE 3.0.0.2 and reinstall 2.2.0.29

Link to comment
Share on other sites

I think this is a library issue.

 

At this path, "C:\DeltaTau\Power PMAC IDE\Compilers\usr\local\dtlibs", delete everything except for the "Default Libraries" folder. Then "unload/reload & clean" the project and then rebuild the project.

 

Hi Steve,

 

I have tested on your suggestion and keep getting the same issue.

This issue happen when I Uninstall IDE 3.0.0.2 and reinstall 2.2.0.29

 

Make sure to install the patch to 2.2.1.25.

Link to comment
Share on other sites

Hi Steve,

 

I upgrade to 2.2.1.25 and still having the same issue.

 

If I don't clean and rebuild, I got this:

 

Please wait while mapping Power PMAC variables.

End of syncing the database.

PMAC variables are mapped successfully.

Build Process For capp1.out has started.

C:\Users\*******\Documents\PowerPmacSuite\PowerPmacPOC\GcodeServo3\GcodeServo3\C Language\Background Programs\capp1\capp1.c(1,0): Error : gplib.h

Build Process For capp1.out has ended.

 

Done building project "GcodeServo3.ppproj" -- FAILED.

 

Build FAILED.

Project Building and Mapping total time = 0.297 sec

Link to comment
Share on other sites

Please contact support@deltatau.com and send the project as a zip file renamed to ".zzz".

 

I don't think is the project file having the issue, it the software after downgrade.

I try using another PC, Windows 7 installing for the 1st time and no issue build and download.

Link to comment
Share on other sites

Guest
This topic is now closed to further replies.
 Share


×
×
  • Create New...