Jump to content
OMRON Forums

Error while build and download


Anil
 Share

Recommended Posts

While build and down load we are getting below error. However when we only download it is downloading without error

 

 

 

Please wait while uploading Libraries from Power Pmac.

Libraries Uploaded successfully

Please wait while Executing Project Script.

Please wait while mapping Power PMAC variables.

End of syncing the database.

PMAC variables are mapped successfully.

Build Process For capp1.out has started.

C:\Users\naika\Desktop\2105withPLC\192.168.0.200_11_31_16\PowerPmac_ALLPOSI.ppproj(230,5): Error : make: *** No rule to make target `capp1.o', needed by `"../../../Bin/Debug/capp1.out"'. Stop.

Build Process For capp1.out has ended.

 

Done building project "PowerPmac_ALLPOSI.ppproj" -- FAILED.

 

Build FAILED.

Project Building and Mapping total time = 6.817 sec

Link to comment
Share on other sites

  • Replies 3
  • Created
  • Last Reply

Top Posters In This Topic

Top Posters In This Topic

Now I have removed the dot in the path but still I get the error while build and download. However download all does not show any error.

 

 

Please wait while uploading Libraries from Power Pmac.

Libraries Uploaded successfully

Please wait while Executing Project Script.

Please wait while mapping Power PMAC variables.

End of syncing the database.

PMAC variables are mapped successfully.

Build Process For capp1.out has started.

C:\Users\naika\Desktop\2105withPLC\PMACproject\PowerPmac_ALLPOSI.ppproj(230,5): Error : make: *** No rule to make target `capp1.o', needed by `"../../../Bin/Debug/capp1.out"'. Stop.

Build Process For capp1.out has ended.

 

Done building project "PowerPmac_ALLPOSI.ppproj" -- FAILED.

 

Build FAILED.

Project Building and Mapping total time = 5.725 sec

Link to comment
Share on other sites

Guest
This topic is now closed to further replies.
 Share


×
×
  • Create New...